Personal tools
You are here: Home Forum Install & build Salome 8.3 GUI Compile On windows errro!

Salome 8.3 GUI Compile On windows errro!

Up to Install & build

Salome 8.3 GUI Compile On windows errro!

Posted by yalong.liu at July 12. 2018

dear salome guys:

     when I compile Salome 8.3 On windows  the error ocurs ,list below.

   1>Link:

1>     Creating library E:/SALOME/SALOME-8.3.0-WIN64/MODULES/GUI/RELEASE/GUI_BUILD/src/CASCatch/Debug/CASCatch.lib and object E:/SALOME/SALOME-8.3.0-WIN64/MODULES/GUI/RELEASE/GUI_BUILD/src/CASCatch/Debug/CASCatch.exp

1>CASCatch_CatchSignals.obj : error LNK2019: unresolved external symbol "public: virtual void __cdecl Standard_Storable::Delete(void)" (?Delete@Standard_Storable@@UEAAXXZ) referenced in function "public: virtual __cdecl Standard_Storable::~Standard_Storable(void)" (??1Standard_Storable@@UEAA@XZ)

1>CASCatch_Failure.obj : error LNK2001: unresolved external symbol "public: virtual void __cdecl Standard_Storable::Delete(void)" (?Delete@Standard_Storable@@UEAAXXZ)

1>CASCatch_CatchSignals.obj : error LNK2001: unresolved external symbol "public: virtual int __cdecl Standard_Storable::HashCode(int)const " (?HashCode@Standard_Storable@@UEBAHH@Z)

1>CASCatch_Failure.obj : error LNK2001: unresolved external symbol "public: virtual int __cdecl Standard_Storable::HashCode(int)const " (?HashCode@Standard_Storable@@UEBAHH@Z)

1>CASCatch_CatchSignals.obj : error LNK2019: unresolved external symbol "public: void __cdecl TCollection_AsciiString::Destroy(void)" (?Destroy@TCollection_AsciiString@@QEAAXXZ) referenced in function "public: __cdecl TCollection_AsciiString::~TCollection_AsciiString(void)" (??1TCollection_AsciiString@@QEAA@XZ)

1>CASCatch_Failure.obj : error LNK2019: unresolved external symbol "public: bool __cdecl Standard_Transient::IsKind(class Handle_Standard_Type const &;)const " (?IsKind@Standard_Transient@@QEBA_NAEBVHandle_Standard_Type@@@Z) referenced in function "public: static class Handle_CASCatch_Failure __cdecl Handle_CASCatch_Failure::DownCast(class Handle_Standard_Transient const &)" (?DownCast@Handle_CASCatch_Failure@@SA?AV1@AEBVHandle_Standard_Transient@@@Z)

1>CASCatch_Failure.obj : error LNK2019: unresolved external symbol "private: void __cdecl Handle_Standard_Transient::BeginScope(void)" (?BeginScope@Handle_Standard_Transient@@AEAAXXZ) referenced in function "public: __cdecl Handle_Standard_Transient::Handle_Standard_Transient(class Handle_Standard_Transient const &)" (??0Handle_Standard_Transient@@QEAA@AEBV0@@Z)

1>CASCatch_Failure.obj : error LNK2019: unresolved external symbol "protected: void __cdecl Handle_Standard_Transient::Assign(class Standard_Transient const *)" (?Assign@Handle_Standard_Transient@@IEAAXPEBVStandard_Transient@@@Z) referenced in function "public: class Handle_CASCatch_Failure & __cdecl Handle_CASCatch_Failure::operator=(class Handle_CASCatch_Failure const &)" (??4Handle_CASCatch_Failure@@QEAAAEAV0@AEBV0@@Z)

1>CASCatch_Failure.obj : error LNK2019: unresolved external symbol "private: void __cdecl Handle_Standard_Transient::EndScope(void)" (?EndScope@Handle_Standard_Transient@@AEAAXXZ) referenced in function "public: __cdecl Handle_Standard_Transient::~Handle_Standard_Transient(void)" (??1Handle_Standard_Transient@@QEAA@XZ)

1>CASCatch_Failure.obj : error LNK2019: unresolved external symbol "public: __cdecl Standard_Type::Standard_Type(char const * const,int,int,void * const,void * const)" (??0Standard_Type@@QEAA@QEBDHHQEAX1@Z) referenced in function "class Handle_Standard_Type const & __cdecl CASCatch_Failure_Type_(void)" (?CASCatch_Failure_Type_@@YAAEBVHandle_Standard_Type@@XZ)

1>CASCatch_Failure.obj : error LNK2019: unresolved external symbol "class Handle_Standard_Type const & __cdecl Standard_Transient_Type_(void)" (?Standard_Transient_Type_@@YAAEBVHandle_Standard_Type@@XZ) referenced in function "class Handle_Standard_Type const & __cdecl CASCatch_Failure_Type_(void)" (?CASCatch_Failure_Type_@@YAAEBVHandle_Standard_Type@@XZ)

1>CASCatch_Failure.obj : error LNK2001: unresolved external symbol "public: virtual class Handle_Standard_Transient __cdecl Standard_Transient::This(void)const " (?This@Standard_Transient@@UEBA?AVHandle_Standard_Transient@@XZ)

1>CASCatch_Failure.obj : error LNK2001: unresolved external symbol "public: virtual class Handle_Standard_Type const & __cdecl Standard_Transient::DynamicType(void)const " (?DynamicType@Standard_Transient@@UEBAAEBVHandle_Standard_Type@@XZ)

1>CASCatch_Failure.obj : error LNK2019: unresolved external symbol "public: virtual __cdecl Standard_Transient::~Standard_Transient(void)" (??1Standard_Transient@@UEAA@XZ) referenced in function "int `public: __cdecl CASCatch_Failure::CASCatch_Failure(char const * const)'::`1'::dtor$0" (?dtor$0@?0???0CASCatch_Failure@@QEAA@QEBD@Z@4HA)

1>E:\SALOME\SALOME-8.3.0-WIN64\MODULES\GUI\RELEASE\GUI_BUILD\src\CASCatch\Debug\CASCatch.dll : fatal error LNK1120: 12 unresolved externals

1>

1>Build FAILED.

 
how to slove this problem, pls help me. thank you!
 
yalong
Powered by Ploneboard
Document Actions